Mo(Cp)2(C2Ph2)
- Formula: C24H20Mo
- Molecular weight: 404.38

Phase change data

Data compiled by: José A. Martinho Simões
Quantity | Value | Units | Method | Reference | Comment |
---|---|---|---|---|---|
ΔsubH° | 35.9 ± 4.8 | kcal/mol | RSC | Calhorda, Carrondo, et al., 1991 |

Gas phase thermochemistry data

Data compiled by: José A. Martinho Simões

Quantity Value Units Method Reference Comment
Δfgas664. ± 22.kJ/molReviewMartinho SimõesThe enthalpy of formation relies on 72.4 ± 8.0 kJ/mol for the enthalpy of formation of Mo(Cp)2(I)2(cr)

Condensed phase thermochemistry data

Data compiled by: José A. Martinho Simões

Quantity Value Units Method Reference Comment
Δfsolid514.0 ± 8.2kJ/molReviewMartinho SimõesThe enthalpy of formation relies on 72.4 ± 8.0 kJ/mol for the enthalpy of formation of Mo(Cp)2(I)2(cr)

References

Calhorda, Carrondo, et al., 1991
Calhorda, M.J.; Carrondo, M.A.A.F.C.T.; Dias, A.R.; Galvão, A.M.; Garcia, M.H.; Martins, A.M.; Minas da Piedade, M.E.; Pinheiro, C.I.; Romão, C.C.; Martinho Simões, J.A.; Veiros, L.F.,
Organometallics, 1991, 10, 483. [all data]