Mo(Cp)2(I)2
- Formula: C10H10I2Mo
- Molecular weight: 479.96

Gas phase thermochemistry data

Data compiled by: José A. Martinho Simões
Quantity | Value | Units | Method | Reference | Comment |
---|---|---|---|---|---|
ΔfH°gas | 31.4 ± 1.2 | kcal/mol | Review | Martinho Simões | |
ΔfH°gas | 41.3 ± 2.2 | kcal/mol | Review | Martinho Simões | The enthalpy of formation relies on the enthalpy of solution of HI in toluene, -7.07 ± 0.55 kcal/mol Calado, Dias, et al., 1979, and on the enthalpy of formation of Mo(Cp)2(H)2(cr), 51.0 ± 1.5 kcal/mol |

Condensed phase thermochemistry data

Data compiled by: José A. Martinho Simões
Quantity | Value | Units | Method | Reference | Comment |
---|---|---|---|---|---|
ΔfH°solid | 7.36 ± 0.60 | kcal/mol | Review | Martinho Simões | |
ΔfH°solid | 17.3 ± 1.9 | kcal/mol | Review | Martinho Simões | The enthalpy of formation relies on the enthalpy of solution of HI in toluene, -7.07 ± 0.55 kcal/mol Calado, Dias, et al., 1979, and on the enthalpy of formation of Mo(Cp)2(H)2(cr), 51.0 ± 1.5 kcal/mol |
Quantity | Value | Units | Method | Reference | Comment |
ΔcH°solid | -1467.4 ± 0.50 | kcal/mol | CC-SB | Tel'noi, Rabinovich, et al., 1976 | Please also see Tel'noi and Rabinovich, 1977. |

Phase change data

Data compiled by: José A. Martinho Simões
Quantity | Value | Units | Method | Reference | Comment |
---|---|---|---|---|---|
ΔsubH° | 24.0 ± 1.0 | kcal/mol | CC-SB | Tel'noi, Rabinovich, et al., 1976 |

Reaction thermochemistry data

Data compiled by: José A. Martinho Simões

Individual Reactions

C10H12Mo (cr) + 2Iodine (cr) = C10H10I2Mo (cr) + 2Hydrogen iodide (g)

By formula: C10H12Mo (cr) + 2I2 (cr) = C10H10I2Mo (cr) + 2HI (g)

Quantity Value Units Method Reference Comment
Δr-87.8 ± 5.1kJ/molRSCCalado, Dias, et al., 1979

C12H14Mo (cr) + Iodine (cr) = C10H10I2Mo (cr) + Ethylene (g)

By formula: C12H14Mo (cr) + I2 (cr) = C10H10I2Mo (cr) + C2H4 (g)

Quantity Value Units Method Reference Comment
Δr-163.0 ± 2.1kJ/molRSCCalhorda, Carrondo, et al., 1991

References

Martinho Simões
Martinho Simões, J.A.,
Private communication (see http://webbook.nist.gov/chemistry/om/). [all data]
Calado, Dias, et al., 1979
Calado, J.C.G.; Dias, A.R.; Martinho Simões, J.A.; Ribeiro da Silva, M.A.V.,
Rev. Port. Quím., 1979, 21, 129. [all data]
Tel'noi, Rabinovich, et al., 1976
Tel'noi, V.I.; Rabinovich, I.B.; Kir'yanov, K.V.; Smirnov, A.S.,
Dokl. Akad. Nauk SSSR, 1976, 231, 733. [all data]
Tel'noi and Rabinovich, 1977
Tel'noi, V.I.; Rabinovich, I.B.,
Russ. Chem. Rev., 1977, 46, 689. [all data]