Mo(Cp)2(Br)2
- Formula: C10H10Br2Mo
- Molecular weight: 385.95

Gas phase thermochemistry data

Data compiled by: José A. Martinho Simões
Quantity | Value | Units | Method | Reference | Comment |
---|---|---|---|---|---|
ΔfH°gas | 121. ± 14. | kJ/mol | Review | Martinho Simões | The enthalpy of formation relies on 213.2 ± 6.1 kJ/mol for the enthalpy of formation of Mo(Cp)2(H)2(cr) |

Condensed phase thermochemistry data

Data compiled by: José A. Martinho Simões
Quantity | Value | Units | Method | Reference | Comment |
---|---|---|---|---|---|
ΔfH°solid | 20. ± 14. | kJ/mol | Review | Martinho Simões | The enthalpy of formation relies on 213.2 ± 6.1 kJ/mol for the enthalpy of formation of Mo(Cp)2(H)2(cr) |

Phase change data

Data compiled by: José A. Martinho Simões
Quantity | Value | Units | Method | Reference | Comment |
---|---|---|---|---|---|
ΔsubH° | 100.4 ± 4.2 | kJ/mol | RSC | Calado, Dias, et al., 1980 |

Reaction thermochemistry data

Data compiled by: José A. Martinho Simões
Individual Reactions
C10H12Mo (cr) + 2 (cr) = C10H10Br2Mo (cr) + 2
(l)
By formula: C10H12Mo (cr) + 2CBr4 (cr) = C10H10Br2Mo (cr) + 2CHBr3 (l)
Quantity | Value | Units | Method | Reference | Comment |
---|---|---|---|---|---|
ΔrH° | -296.5 ± 4.5 | kJ/mol | RSC | Calado, Dias, et al., 1980 |

References

Martinho Simões
Martinho Simões, J.A.,
Private communication (see http://webbook.nist.gov/chemistry/om/). [all data]