Mo(Cp)2(SBu)2
- Formula: C18H28MoS2
- Molecular weight: 404.50

Condensed phase thermochemistry data

Data compiled by: José A. Martinho Simões
Quantity | Value | Units | Method | Reference | Comment |
---|---|---|---|---|---|
ΔfH°solid | -96.3 ± 5.6 | kJ/mol | Review | Martinho Simões | The enthalpy of formation relies on -96.3 ± 2.9 kJ/mol for the enthalpy of formation of Mo(Cp)2(Cl)2(cr) |

Phase change data

Data compiled by: José A. Martinho Simões
Quantity | Value | Units | Method | Reference | Comment |
---|---|---|---|---|---|
ΔsubH° | 92. ± 10. | kJ/mol | RSC | Dias, Martinho Simões, et al., 1981 |

Gas phase thermochemistry data

Data compiled by: José A. Martinho Simões
Quantity | Value | Units | Method | Reference | Comment |
---|---|---|---|---|---|
ΔfH°gas | -1.0 ± 2.7 | kcal/mol | Review | Martinho Simões | The enthalpy of formation relies on -23.0 ± 0.69 kcal/mol for the enthalpy of formation of Mo(Cp)2(Cl)2(cr) |

References

Martinho Simões
Martinho Simões, J.A.,
Private communication (see http://webbook.nist.gov/chemistry/om/). [all data]
Dias, Martinho Simões, et al., 1981
Dias, A.R.; Martinho Simões, J.A.; Teixeira, C.,
J. Chem. Soc., Dalton Trans., 1981, 1178. [all data]