Mo(Cp)2(SPr)2
- Formula: C16H24MoS2
- Molecular weight: 376.45

Gas phase thermochemistry data

Data compiled by: José A. Martinho Simões
Quantity | Value | Units | Method | Reference | Comment |
---|---|---|---|---|---|
ΔfH°gas | 79. ± 12. | kJ/mol | Review | Martinho Simões | The enthalpy of formation relies on -96.3 ± 2.9 kJ/mol for the enthalpy of formation of Mo(Cp)2(Cl)2(cr) |

Condensed phase thermochemistry data

Data compiled by: José A. Martinho Simões
Quantity | Value | Units | Method | Reference | Comment |
---|---|---|---|---|---|
ΔfH°solid | -11.2 ± 5.6 | kJ/mol | Review | Martinho Simões | The enthalpy of formation relies on -96.3 ± 2.9 kJ/mol for the enthalpy of formation of Mo(Cp)2(Cl)2(cr) |

References

Martinho Simões
Martinho Simões, J.A.,
Private communication (see http://webbook.nist.gov/chemistry/om/). [all data]