Mo(Cp)2(SO4)
- Formula: C10H10MoO4S
- Molecular weight: 322.21

Gas phase thermochemistry data

Data compiled by: José A. Martinho Simões
Quantity | Value | Units | Method | Reference | Comment |
---|---|---|---|---|---|
ΔfH°gas | -138.2 ± 2.9 | kcal/mol | Review | Martinho Simões | The enthalpy of formation relies on -86.4 ± 1.1 kcal/mol for the enthalpy of formation of Mo(Cp)2(SC10H21)(cr) |
ΔfH°gas | -138.5 ± 2.6 | kcal/mol | Review | Martinho Simões | The enthalpy of formation relies on -120.0 ± 0.88 kcal/mol for the enthalpy of formation of Mo(Cp)2(OOCPh)2(cr) |
ΔfH°gas | -138.4 ± 2.6 | kcal/mol | Review | Martinho Simões | Selected data. Average of the values from Calhorda, Carrondo, et al., 1986 |

Condensed phase thermochemistry data

Data compiled by: José A. Martinho Simões
Quantity | Value | Units | Method | Reference | Comment |
---|---|---|---|---|---|
ΔfH°solid | -155.4 ± 1.6 | kcal/mol | Review | Martinho Simões | The enthalpy of formation relies on -86.4 ± 1.1 kcal/mol for the enthalpy of formation of Mo(Cp)2(SC10H21)(cr) |
ΔfH°solid | -155.7 ± 1.1 | kcal/mol | Review | Martinho Simões | The enthalpy of formation relies on -120.0 ± 0.88 kcal/mol for the enthalpy of formation of Mo(Cp)2(OOCPh)2(cr) |
ΔfH°solid | -155.6 ± 0.96 | kcal/mol | Review | Martinho Simões | Selected data. Average of the values from Calhorda, Carrondo, et al., 1986 |

References

Martinho Simões
Martinho Simões, J.A.,
Private communication (see http://webbook.nist.gov/chemistry/om/). [all data]
Calhorda, Carrondo, et al., 1986
Calhorda, M.J.; Carrondo, M.A.A.F.C.T.; Dias, A.R.; Domingos, A.M.T.S.; Martinho Simões, J.A.; Teixeira, C.,
Organometallics, 1986, 5, 660. [all data]