Mo(Cp)2(N2Ph2)
- Formula: C22H20MoN2
- Molecular weight: 408.37

Gas phase thermochemistry data

Data compiled by: José A. Martinho Simões
Quantity | Value | Units | Method | Reference | Comment |
---|---|---|---|---|---|
ΔfH°gas | 624. ± 17. | kJ/mol | Review | Martinho Simões | The enthalpy of formation relies on 72.4 ± 8.0 kJ/mol for the enthalpy of formation of Mo(Cp)2(I)2(cr) |

Condensed phase thermochemistry data

Data compiled by: José A. Martinho Simões
Quantity | Value | Units | Method | Reference | Comment |
---|---|---|---|---|---|
ΔfH°solid | 554.4 ± 8.8 | kJ/mol | Review | Martinho Simões | The enthalpy of formation relies on 72.4 ± 8.0 kJ/mol for the enthalpy of formation of Mo(Cp)2(I)2(cr) |

Phase change data

Data compiled by: José A. Martinho Simões

Quantity Value Units Method Reference Comment
Δsub70. ± 15.kJ/molRSCDias, Dias, et al., 1987

References

Martinho Simões
Martinho Simões, J.A.,
Private communication (see http://webbook.nist.gov/chemistry/om/). [all data]