Mo(Cp)(CO)3(Me)
- Formula: C9H8MoO3
- Molecular weight: 260.12

Reaction thermochemistry data

Data compiled by: José A. Martinho Simões
Individual Reactions
C8H5MoNaO3 (solution) + (l) = C9H8MoO3 (solution) +
(cr)
By formula: C8H5MoNaO3 (solution) + CH3I (l) = C9H8MoO3 (solution) + INa (cr)
Quantity | Value | Units | Method | Reference | Comment |
---|---|---|---|---|---|
ΔrH° | -7.70 ± 0.31 | kcal/mol | RSC | Nolan, López de la Vega, et al., 1986 | solvent: Tetrahydrofuran |

References

Nolan, López de la Vega, et al., 1986
Nolan, S.P.; López de la Vega, R.; Hoff, C.D.,
J. Organometal. Chem., 1986, 315, 187. [all data]