Cr(CO)4(pip)2
- Formula: C14H22CrN2O4
- Molecular weight: 334.3316

Condensed phase thermochemistry data

Data compiled by: José A. Martinho Simões
Quantity | Value | Units | Method | Reference | Comment |
---|---|---|---|---|---|
ΔfH°solid | -900.7 ± 8.5 | kJ/mol | Review | Martinho Simões | The enthalpy of formation relies on -908.4 ± 2.6 kJ/mol for the enthalpy of formation of Cr(CO)6(g) |

Phase change data

Data compiled by: José A. Martinho Simões
Quantity | Value | Units | Method | Reference | Comment |
---|---|---|---|---|---|
ΔsubH° | 110. ± 10. | kJ/mol | DSC | Daamen, van der Poel, et al., 1979 |

Gas phase thermochemistry data

Data compiled by: José A. Martinho Simões
Quantity | Value | Units | Method | Reference | Comment |
---|---|---|---|---|---|
ΔfH°gas | -791. ± 13. | kJ/mol | Review | Martinho Simões | The enthalpy of formation relies on -908.4 ± 2.6 kJ/mol for the enthalpy of formation of Cr(CO)6(g) |

References

Martinho Simões
Martinho Simões, J.A.,
Private communication (see http://webbook.nist.gov/chemistry/om/). [all data]
Daamen, van der Poel, et al., 1979
Daamen, H.; van der Poel, H.; Stufkens, D.J.; Oskam, A.,
Thermochim. Acta, 1979, 34, 69. [all data]