Cr(CO)4(py)2
- Formula: C14H10CrN2O4
- Molecular weight: 322.2363

Gas phase thermochemistry data

Data compiled by: José A. Martinho Simões
Quantity | Value | Units | Method | Reference | Comment |
---|---|---|---|---|---|
ΔfH°gas | -388. ± 22. | kJ/mol | Review | Martinho Simões | The value for the enthalpy of formation was recommended in Adedeji, Connor, et al., 1978 |

Condensed phase thermochemistry data

Data compiled by: José A. Martinho Simões
Quantity | Value | Units | Method | Reference | Comment |
---|---|---|---|---|---|
ΔfH°solid | -505. ± 20. | kJ/mol | Review | Martinho Simões | The value for the enthalpy of formation was recommended in Adedeji, Connor, et al., 1978 |

Phase change data

Data compiled by: José A. Martinho Simões
Quantity | Value | Units | Method | Reference | Comment |
---|---|---|---|---|---|
ΔsubH° | 117. ± 10. | kJ/mol | TD-HFC | Adedeji, Connor, et al., 1978 |

Reaction thermochemistry data

Data compiled by: José A. Martinho Simões
Individual Reactions
C14H10CrN2O4 (cr) = 2 (g) + 4 (g) + (cr)
By formula: C14H10CrN2O4 (cr) = 2C4H4N2 (g) + 4CO (g) + Cr (cr)
Quantity | Value | Units | Method | Reference | Comment |
---|---|---|---|---|---|
ΔrH° | >199. | kJ/mol | TD-HFC | Adedeji, Connor, et al., 1978 | The reaction enthalpy is a low limit Adedeji, Connor, et al., 1978. |

References

Martinho Simões
Martinho Simões, J.A.,
Private communication (see http://webbook.nist.gov/chemistry/om/). [all data]
Adedeji, Connor, et al., 1978
Adedeji, F.A.; Connor, J.A.; Demain, C.P.; Martinho Simões, J.A.; Skinner, H.A.; Zafarani- Moattar, M.T.,
J. Organometal. Chem., 1978, 149, 333. [all data]