Cr(CO)5(1-C6H12)

Reaction thermochemistry data

Data compiled by: José A. Martinho Simões

Individual Reactions

C12H16CrO5 (solution) + 1-Hexene (solution) = C11H12CrO5 (solution) + Heptane (solution)

By formula: C12H16CrO5 (solution) + C6H12 (solution) = C11H12CrO5 (solution) + C7H16 (solution)

Quantity Value Units Method Reference Comment
Δr-51.0 ± 5.0kJ/molPACYang, Peters, et al., 1986solvent: Heptane

References

Yang, Peters, et al., 1986
Yang, G.K.; Peters, K.S.; Vaida, V., Chem. Phys. Lett., 1986, 125, 566. [all data]