Cr(CO)5(C4H4N2)
- Formula: C9H4CrN2O5
- Molecular weight: 272.1346

Condensed phase thermochemistry data

Data compiled by: José A. Martinho Simões
Quantity | Value | Units | Method | Reference | Comment |
---|---|---|---|---|---|
ΔfH°solid | -633.8 ± 5.8 | kJ/mol | Review | Martinho Simões | The enthalpy of formation relies on -908.4 ± 2.6 kJ/mol for the enthalpy of formation of Cr(CO)6(g) |

Phase change data

Data compiled by: José A. Martinho Simões
Quantity | Value | Units | Method | Reference | Comment |
---|---|---|---|---|---|
ΔsubH° | 99.7 ± 3.0 | kJ/mol | DSC | Daamen, Ernsting, et al., 1979 |

Gas phase thermochemistry data

Data compiled by: José A. Martinho Simões
Quantity | Value | Units | Method | Reference | Comment |
---|---|---|---|---|---|
ΔfH°gas | -127.7 ± 1.6 | kcal/mol | Review | Martinho Simões | The enthalpy of formation relies on -217.1 ± 0.62 kcal/mol for the enthalpy of formation of Cr(CO)6(g) |

References

Martinho Simões
Martinho Simões, J.A.,
Private communication (see http://webbook.nist.gov/chemistry/om/). [all data]
Daamen, Ernsting, et al., 1979
Daamen, H.; Ernsting, J.M.; Oskam, A.,
Thermochim. Acta, 1979, 33, 217. [all data]