Cr(CO)5(n-C7H16)

Reaction thermochemistry data

Data compiled by: José A. Martinho Simões

Individual Reactions

Chromium hexacarbonyl (solution) + Heptane (solution) = C12H16CrO5 (solution) + Carbon monoxide (solution)

By formula: C6CrO6 (solution) + C7H16 (solution) = C12H16CrO5 (solution) + CO (solution)

Quantity Value Units Method Reference Comment
Δr113. ± 3.kJ/molAVGN/AAverage of 13 values; Individual data points

C12H16CrO5 (solution) = Heptane (solution) + C5CrO5 (solution)

By formula: C12H16CrO5 (solution) = C7H16 (solution) + C5CrO5 (solution)

Quantity Value Units Method Reference Comment
Δr40.2kJ/molN/AMorse, Parker, et al., 1989solvent: Heptane; The reaction enthalpy was derived by using the LPHP value for the enthalpy of cleavage of Cr-CO bond in Cr(CO)6, 154.0 kJ/mol Lewis, Golden, et al., 1984, toghether with a PAC value for the reaction Cr(CO)6(solution) + n-C7H16(solution) = Cr(CO)5(n-C7H16)(solution) + CO(solution), 113.8 kJ/mol Morse, Parker, et al., 1989
Δr41.kJ/molN/AYang, Vaida, et al., 1988solvent: Heptane; The reaction enthalpy was derived by using the LPHP value for the enthalpy of cleavage of Cr-CO bond in Cr(CO)6, 154.0 kJ/mol Lewis, Golden, et al., 1984, toghether with a PAC value for the reaction Cr(CO)6(solution) + n-C7H16(solution) = Cr(CO)5(n-C7H16)(solution) + CO(solution), 112.9 kJ/mol Yang, Peters, et al., 1986

C12H16CrO5 (solution) + 1,3-Diazine (solution) = Heptane (solution) + C10H5CrNO5 (solution)

By formula: C12H16CrO5 (solution) + C4H4N2 (solution) = C7H16 (solution) + C10H5CrNO5 (solution)

Quantity Value Units Method Reference Comment
Δr-84.1 ± 1.7kJ/molPACYang, Vaida, et al., 1988solvent: Heptane

C12H16CrO5 (solution) + Tetrahydrofuran (solution) = C9H8CrO6 (solution) + Heptane (solution)

By formula: C12H16CrO5 (solution) + C4H8O (solution) = C9H8CrO6 (solution) + C7H16 (solution)

Quantity Value Units Method Reference Comment
Δr-51.9 ± 5.0kJ/molPACYang, Peters, et al., 1986solvent: Heptane

C12H16CrO5 (solution) + Acetone (solution) = Heptane (solution) + C8H6CrO6 (solution)

By formula: C12H16CrO5 (solution) + C3H6O (solution) = C7H16 (solution) + C8H6CrO6 (solution)

Quantity Value Units Method Reference Comment
Δr-56.5 ± 5.0kJ/molPACYang, Peters, et al., 1986solvent: Heptane

C12H16CrO5 (solution) + Tributylamine (solution) = C17H27CrNO5 (solution) + Heptane (solution)

By formula: C12H16CrO5 (solution) + C12H27N (solution) = C17H27CrNO5 (solution) + C7H16 (solution)

Quantity Value Units Method Reference Comment
Δr-51.0 ± 5.0kJ/molPACYang, Peters, et al., 1986solvent: Heptane

C12H16CrO5 (solution) + 1-Hexene (solution) = C11H12CrO5 (solution) + Heptane (solution)

By formula: C12H16CrO5 (solution) + C6H12 (solution) = C11H12CrO5 (solution) + C7H16 (solution)

Quantity Value Units Method Reference Comment
Δr-51.0 ± 5.0kJ/molPACYang, Peters, et al., 1986solvent: Heptane

C12H16CrO5 (solution) + Ethanol (solution) = C7H5CrO6 (solution) + Heptane (solution)

By formula: C12H16CrO5 (solution) + C2H6O (solution) = C7H5CrO6 (solution) + C7H16 (solution)

Quantity Value Units Method Reference Comment
Δr-57.7 ± 5.0kJ/molPACYang, Peters, et al., 1986solvent: Heptane

C12H16CrO5 (solution) + Acetonitrile (solution) = C8H6CrNO5 (solution) + Heptane (solution)

By formula: C12H16CrO5 (solution) + C2H3N (solution) = C8H6CrNO5 (solution) + C7H16 (solution)

Quantity Value Units Method Reference Comment
Δr-76.1 ± 5.0kJ/molPACYang, Peters, et al., 1986solvent: Heptane

References

Morse, Parker, et al., 1989
Morse, J.M., Jr.; Parker, G.H.; Burkey, T.J., Organometallics, 1989, 8, 2471. [all data]

Lewis, Golden, et al., 1984
Lewis, K.E.; Golden, D.M.; Smith, G.P., Organometallic bond dissociation energies: Laser pyrolysis of Fe(CO)5, Cr(CO)6, Mo(CO)6, and W(CO)6, J. Am. Chem. Soc., 1984, 106, 3905. [all data]

Yang, Vaida, et al., 1988
Yang, G.K.; Vaida, V.; Peters, K.S., Polyhedron, 1988, 7, 1619. [all data]

Yang, Peters, et al., 1986
Yang, G.K.; Peters, K.S.; Vaida, V., Chem. Phys. Lett., 1986, 125, 566. [all data]