Cr(i-PrPh)[1,2-(i-Pr)2C6H4]
- Formula: C21H30Cr
- Molecular weight: 334.4590

Condensed phase thermochemistry data

Data compiled by: José A. Martinho Simões
Quantity | Value | Units | Method | Reference | Comment |
---|---|---|---|---|---|
ΔfH°liquid | -132.3 ± 7.5 | kJ/mol | Review | Martinho Simões | |
Quantity | Value | Units | Method | Reference | Comment |
ΔcH°liquid | -12989.2 ± 6.9 | kJ/mol | CC-SB | Tel'noi, Rabinovich, et al., 1973 | Please also see Pedley and Rylance, 1977. |

Phase change data

Data compiled by: José A. Martinho Simões
Quantity | Value | Units | Method | Reference | Comment |
---|---|---|---|---|---|
ΔvapH° | 100.4 ± 8.4 | kJ/mol | CC-SB | Tel'noi, Rabinovich, et al., 1973 |

Gas phase thermochemistry data

Data compiled by: José A. Martinho Simões
Quantity | Value | Units | Method | Reference | Comment |
---|---|---|---|---|---|
ΔfH°gas | -7.6 ± 2.7 | kcal/mol | Review | Martinho Simões |

References

Martinho Simões
Martinho Simões, J.A.,
Private communication (see http://webbook.nist.gov/chemistry/om/). [all data]
Tel'noi, Rabinovich, et al., 1973
Tel'noi, V.I.; Rabinovich, I.B.; Umilin, V.A.,
Dokl. Akad. Nauk SSSR, 1973, 209, 197. [all data]
Pedley and Rylance, 1977
Pedley, J.B.; Rylance, J.,
Computer Analysed Thermochemical Data: Organic and Organometallic Compounds, University of Sussex, Brigton, 1977. [all data]