Sb(Me)2

Reaction thermochemistry data

Data compiled by: José A. Martinho Simões

Individual Reactions

Stibine, trimethyl- (g) = C2H6Sb (g) + Methane (g)

By formula: C3H9Sb (g) = C2H6Sb (g) + CH4 (g)

Quantity Value Units Method Reference Comment
Δr247. - 259.kJ/molN/ASmith and Patrick, 1983
Δr255. ± 17.kJ/molN/AMcMillen and Golden, 1982

References

Smith and Patrick, 1983
Smith, G.P.; Patrick, R., Int. J. Chem. Kinet., 1983, 15, 167. [all data]

McMillen and Golden, 1982
McMillen, D.F.; Golden, D.M., Hydrocarbon bond dissociation energies, Ann. Rev. Phys. Chem., 1982, 33, 493. [all data]