Pb(Ph)2(I)2
- Formula: C12H10I2Pb
- Molecular weight: 615.2

Condensed phase thermochemistry data

Data compiled by: José A. Martinho Simões
Quantity | Value | Units | Method | Reference | Comment |
---|---|---|---|---|---|
ΔfH°solid | 150. ± 18. | kJ/mol | Review | Martinho Simões | The enthalpy of formation relies on 515. ± 15. kJ/mol for the enthalpy of formation of Pb(Ph)4(cr). |

Phase change data

Data compiled by: José A. Martinho Simões
Quantity | Value | Units | Method | Reference | Comment |
---|---|---|---|---|---|
ΔsubH° | 138.0 ± 4.2 | kJ/mol | RSC | Butler R.S., Carson, et al., 1976 |

Gas phase thermochemistry data

Data compiled by: José A. Martinho Simões
Quantity | Value | Units | Method | Reference | Comment |
---|---|---|---|---|---|
ΔfH°gas | 68.9 ± 4.3 | kcal/mol | Review | Martinho Simões | The enthalpy of formation relies on 123.1 ± 3.7 kcal/mol for the enthalpy of formation of Pb(Ph)4(cr). |

References

Martinho Simões
Martinho Simões, J.A.,
Private communication (see http://webbook.nist.gov/chemistry/om/). [all data]
Butler R.S., Carson, et al., 1976
Butler R.S.; Carson, A.S.; Laye, P.G.; Steele, W.V.,
J. Chem. Thermodyn., 1976, 8, 1153. [all data]