Pb(Ph)3(I)
- Formula: C18H15IPb
- Molecular weight: 565.4

Condensed phase thermochemistry data

Data compiled by: José A. Martinho Simões
Quantity | Value | Units | Method | Reference | Comment |
---|---|---|---|---|---|
ΔfH°solid | 77.7 ± 4.3 | kcal/mol | Review | Martinho Simões | The enthalpy of formation relies on 35.9 ± 4.2 kcal/mol for the enthalpy of formation of Pb(Ph)2(I)2(cr). |

Phase change data

Data compiled by: José A. Martinho Simões
Quantity | Value | Units | Method | Reference | Comment |
---|---|---|---|---|---|
ΔsubH° | 31.09 ± 0.1 | kcal/mol | RSC | Butler R.S., Carson, et al., 1976 |

Gas phase thermochemistry data

Data compiled by: José A. Martinho Simões
Quantity | Value | Units | Method | Reference | Comment |
---|---|---|---|---|---|
ΔfH°gas | 108.8 ± 4.3 | kcal/mol | Review | Martinho Simões | The enthalpy of formation relies on 35.9 ± 4.2 kcal/mol for the enthalpy of formation of Pb(Ph)2(I)2(cr). |

References

Martinho Simões
Martinho Simões, J.A.,
Private communication (see http://webbook.nist.gov/chemistry/om/). [all data]
Butler R.S., Carson, et al., 1976
Butler R.S.; Carson, A.S.; Laye, P.G.; Steele, W.V.,
J. Chem. Thermodyn., 1976, 8, 1153. [all data]