Pb(Et)3

Gas phase thermochemistry data

Data compiled by: José A. Martinho Simões

Quantity Value Units Method Reference Comment
Δfgas221. ± 18.kJ/molReviewMartinho SimõesThe enthalpy of formation relies on 109.6 ± 5.1 kJ/mol for the enthalpy of formation of Pb(Et)4(g).
Δfgas217. ± 14.kJ/molReviewMartinho SimõesThe enthalpy of formation relies on 109.6 ± 5.1 kJ/mol for the enthalpy of formation of Pb(Et)4(g).

References

Martinho Simões
Martinho Simões, J.A., Private communication (see http://webbook.nist.gov/chemistry/om/). [all data]