Pb(Me)3
- Formula: C3H9Pb
- Molecular weight: 252.3

Gas phase thermochemistry data

Data compiled by: José A. Martinho Simões
Quantity | Value | Units | Method | Reference | Comment |
---|---|---|---|---|---|
ΔfH°gas | 54.4 ± 4.1 | kcal/mol | Review | Martinho Simões | The enthalpy of formation relies on 32.5 ± 1.1 kcal/mol for the enthalpy of formation of Pb(Me)4(g). |
ΔfH°gas | 52.3 to 55.4 | kcal/mol | Review | Martinho Simões | The enthalpy of formation limits rely on 32.5 ± 1.1 kcal/mol for the enthalpy of formation of Pb(Me)4(g). |

Reaction thermochemistry data

Data compiled by: José A. Martinho Simões

Individual Reactions

Lead, tetramethyl- (g) = C3H9Pb (g) + Methane (g)

By formula: C4H12Pb (g) = C3H9Pb (g) + CH4 (g)

Quantity Value Units Method Reference Comment
Δr230. - 243.kJ/molN/ASmith and Patrick, 1983
Δr239. ± 17.kJ/molN/AMcMillen and Golden, 1982

References

Martinho Simões
Martinho Simões, J.A.,
Private communication (see http://webbook.nist.gov/chemistry/om/). [all data]