Sn(Bu)3(Br)
- Formula: C12H27BrSn
- Molecular weight: 369.957

Condensed phase thermochemistry data

Data compiled by: José A. Martinho Simões
Quantity | Value | Units | Method | Reference | Comment |
---|---|---|---|---|---|
ΔfH°liquid | -354.3 ± 4.2 | kJ/mol | Review | Martinho Simões | The enthalpy of formation relies on -300.2 ± 4.0 kJ/mol for the enthalpy of formation of Sn(Bu)4(l). |

Phase change data

Data compiled by: José A. Martinho Simões
Quantity | Value | Units | Method | Reference | Comment |
---|---|---|---|---|---|
ΔvapH° | 84. ± 13. | kJ/mol | RSC | Davies, Pope, et al., 1963 |

Gas phase thermochemistry data

Data compiled by: José A. Martinho Simões
Quantity | Value | Units | Method | Reference | Comment |
---|---|---|---|---|---|
ΔfH°gas | -271. ± 13. | kJ/mol | Review | Martinho Simões | The enthalpy of formation relies on -300.2 ± 4.0 kJ/mol for the enthalpy of formation of Sn(Bu)4(l). |

References

Martinho Simões
Martinho Simões, J.A.,
Private communication (see http://webbook.nist.gov/chemistry/om/). [all data]
Davies, Pope, et al., 1963
Davies, J.V.; Pope, A.E.; Skinner, H.A.,
Thermochemistry of metallic alkyls. Part 10.?Heats of combustion of some tetra-alkyls of tin,
Trans. Faraday Soc., 1963, 59, 2233, https://doi.org/10.1039/tf9635902233
. [all data]