Sn(Me)3(I)
- Formula: C3H9ISn
- Molecular weight: 290.718

Condensed phase thermochemistry data

Data compiled by: José A. Martinho Simões
Quantity | Value | Units | Method | Reference | Comment |
---|---|---|---|---|---|
ΔfH°liquid | -130.6 ± 4.1 | kJ/mol | Review | Martinho Simões | The enthalpy of formation relies on -77.1 ± 7.7 kJ/mol for the enthalpy of formation of Sn2(Me)6(l). |

Phase change data

Data compiled by: José A. Martinho Simões
Quantity | Value | Units | Method | Reference | Comment |
---|---|---|---|---|---|
ΔvapH° | 48.1 ± 4.2 | kJ/mol | RSC | Davies, Pope, et al., 1963 |

Gas phase thermochemistry data

Data compiled by: José A. Martinho Simões
Quantity | Value | Units | Method | Reference | Comment |
---|---|---|---|---|---|
ΔfH°gas | -82.5 ± 5.9 | kJ/mol | Review | Martinho Simões | The enthalpy of formation relies on -77.1 ± 7.7 kJ/mol for the enthalpy of formation of Sn2(Me)6(l). |

Reaction thermochemistry data

Data compiled by: José A. Martinho Simões

Individual Reactions

Hexamethylditin (l) + Iodine (cr) = 2C3H9ISn (l)

By formula: C6H18Sn2 (l) + I2 (cr) = 2C3H9ISn (l)

Quantity Value Units Method Reference Comment
Δr-184.1 ± 2.9kJ/molRSCPedley, Skinner, et al., 1957Please also see Pedley and Rylance, 1977 and Cox and Pilcher, 1970.

C3H9ISn (l) + Water (l) = (Hydrogen iodide • 55Water) (solution) + C3H10OSn (cr)

By formula: C3H9ISn (l) + H2O (l) = (HI • 55H2O) (solution) + C3H10OSn (cr)

Quantity Value Units Method Reference Comment
Δr-17.6 ± 0.4kJ/molRSCBaldwin, Lappert, et al., 1972

References

Martinho Simões
Martinho Simões, J.A.,
Private communication (see http://webbook.nist.gov/chemistry/om/). [all data]
Davies, Pope, et al., 1963
Davies, J.V.; Pope, A.E.; Skinner, H.A.,
Thermochemistry of metallic alkyls. Part 10.?Heats of combustion of some tetra-alkyls of tin,
Trans. Faraday Soc., 1963, 59, 2233, https://doi.org/10.1039/tf9635902233
. [all data]