Sn(Et)3(NEt2)
- Formula: C10H25NSn
- Molecular weight: 278.022

Condensed phase thermochemistry data

Data compiled by: José A. Martinho Simões
Quantity | Value | Units | Method | Reference | Comment |
---|---|---|---|---|---|
ΔfH°liquid | -207.1 ± 4.4 | kJ/mol | Review | Martinho Simões | |
Quantity | Value | Units | Method | Reference | Comment |
ΔcH°liquid | -7878.5 ± 4.2 | kJ/mol | CC-SB | Kol'yakova, Rabinovich, et al., 1971 | Please also see Pedley and Rylance, 1977. |

Phase change data

Data compiled by: José A. Martinho Simões
Quantity | Value | Units | Method | Reference | Comment |
---|---|---|---|---|---|
ΔvapH° | 50.2 ± 4.2 | kJ/mol | CC-SB | Kol'yakova, Rabinovich, et al., 1971 |

Gas phase thermochemistry data

Data compiled by: José A. Martinho Simões
Quantity | Value | Units | Method | Reference | Comment |
---|---|---|---|---|---|
ΔfH°gas | -37.5 ± 1.5 | kcal/mol | Review | Martinho Simões |

References

Martinho Simões
Martinho Simões, J.A.,
Private communication (see http://webbook.nist.gov/chemistry/om/). [all data]
Kol'yakova, Rabinovich, et al., 1971
Kol'yakova, G.M.; Rabinovich, I.B.; Vyazankin, N.S.,
Dokl. Akad. Nauk SSSR, 1971, 200, 1, 111. [all data]
Pedley and Rylance, 1977
Pedley, J.B.; Rylance, J.,
Computer Analysed Thermochemical Data: Organic and Organometallic Compounds, University of Sussex, Brigton, 1977. [all data]