Sn(Ph)2(CH2)5
- Formula: C17H20Sn
- Molecular weight: 343.051

Gas phase thermochemistry data

Data compiled by: José A. Martinho Simões
Quantity | Value | Units | Method | Reference | Comment |
---|---|---|---|---|---|
ΔfH°gas | 292.1 ± 6.9 | kJ/mol | Review | Martinho Simões |

Condensed phase thermochemistry data

Data compiled by: José A. Martinho Simões
Quantity | Value | Units | Method | Reference | Comment |
---|---|---|---|---|---|
ΔfH°liquid | 217.1 ± 6.7 | kJ/mol | Review | Martinho Simões | |
Quantity | Value | Units | Method | Reference | Comment |
ΔcH°liquid | -10342.7 ± 6.3 | kJ/mol | CC-SB | Carson, Jamea, et al., 1988 |

Phase change data

Data compiled by: José A. Martinho Simões
Quantity | Value | Units | Method | Reference | Comment |
---|---|---|---|---|---|
ΔvapH° | 75.0 ± 1.5 | kJ/mol | CC-SB | Carson, Jamea, et al., 1988 |

References

Martinho Simões
Martinho Simões, J.A.,
Private communication (see http://webbook.nist.gov/chemistry/om/). [all data]
Carson, Jamea, et al., 1988
Carson, A.S.; Jamea, E.H.; Laye, P.G.,
J. Chem. Thermodyn., 1988, 20, 923. [all data]