Sn(Ph)2(CH2)4
- Formula: C16H18Sn
- Molecular weight: 329.024

Gas phase thermochemistry data

Data compiled by: José A. Martinho Simões
Quantity | Value | Units | Method | Reference | Comment |
---|---|---|---|---|---|
ΔfH°gas | 304.9 ± 7.6 | kJ/mol | Review | Martinho Simões |

Condensed phase thermochemistry data

Data compiled by: José A. Martinho Simões
Quantity | Value | Units | Method | Reference | Comment |
---|---|---|---|---|---|
ΔfH°solid | 198.1 ± 5.2 | kJ/mol | Review | Martinho Simões | |
Quantity | Value | Units | Method | Reference | Comment |
ΔcH°solid | -9644.4 ± 4.7 | kJ/mol | CC-SB | Carson, Jamea, et al., 1988 |

Phase change data

Data compiled by: José A. Martinho Simões
Quantity | Value | Units | Method | Reference | Comment |
---|---|---|---|---|---|
ΔsubH° | 106.8 ± 5.5 | kJ/mol | CC-SB | Carson, Jamea, et al., 1988 |

References

Martinho Simões
Martinho Simões, J.A.,
Private communication (see http://webbook.nist.gov/chemistry/om/). [all data]
Carson, Jamea, et al., 1988
Carson, A.S.; Jamea, E.H.; Laye, P.G.,
J. Chem. Thermodyn., 1988, 20, 923. [all data]