[Ge(Me)2O]4
- Formula: C8H24Ge4O4
- Molecular weight: 474.83

Condensed phase thermochemistry data

Data compiled by: José A. Martinho Simões
Quantity | Value | Units | Method | Reference | Comment |
---|---|---|---|---|---|
ΔfH°solid | -1522. ± 21. | kJ/mol | Review | Martinho Simões | |
Quantity | Value | Units | Method | Reference | Comment |
ΔcH°solid | -7212. ± 20. | kJ/mol | CC-SB | Volchkova, Smol'yaninova, et al., 1972 | Please also see Pedley and Rylance, 1977. |

Phase change data

Data compiled by: José A. Martinho Simões
Quantity | Value | Units | Method | Reference | Comment |
---|---|---|---|---|---|
ΔsubH° | 68.2 ± 4.2 | kJ/mol | CC-SB | Volchkova, Smol'yaninova, et al., 1972 |

Gas phase thermochemistry data

Data compiled by: José A. Martinho Simões
Quantity | Value | Units | Method | Reference | Comment |
---|---|---|---|---|---|
ΔfH°gas | -347.4 ± 5.2 | kcal/mol | Review | Martinho Simões |

References

Martinho Simões
Martinho Simões, J.A.,
Private communication (see http://webbook.nist.gov/chemistry/om/). [all data]
Volchkova, Smol'yaninova, et al., 1972
Volchkova, E.A.; Smol'yaninova, D.D.; Genchel', V.G.; Lopatkina, I.L.; Shaulov, Y.K.,
Heat of combustion, enthalpy of formation, and heat of evaporation of octamethyltetragermoxane,
Russ. J. Phys. Chem. (Engl. Transl.), 1972, 46, 1053. [all data]
Pedley and Rylance, 1977
Pedley, J.B.; Rylance, J.,
Computer Analysed Thermochemical Data: Organic and Organometallic Compounds, University of Sussex, Brigton, 1977. [all data]