Ge(Et)3(NEt2)
- Formula: C10H25GeN
- Molecular weight: 231.95

Condensed phase thermochemistry data

Data compiled by: José A. Martinho Simões
Quantity | Value | Units | Method | Reference | Comment |
---|---|---|---|---|---|
ΔfH°liquid | -344.3 ± 4.9 | kJ/mol | Review | Martinho Simões | |
Quantity | Value | Units | Method | Reference | Comment |
ΔcH°liquid | -7702.7 ± 4.2 | kJ/mol | CC-SB | Kol'yakova, Rabinovich, et al., 1971 | Please also see Pedley and Rylance, 1977. |

Phase change data

Data compiled by: José A. Martinho Simões
Quantity | Value | Units | Method | Reference | Comment |
---|---|---|---|---|---|
ΔvapH° | 46.0 ± 4.8 | kJ/mol | CC-SB | Goncharov, Karapet'yants, et al., 1970 |

References

Martinho Simões
Martinho Simões, J.A.,
Private communication (see http://webbook.nist.gov/chemistry/om/). [all data]
Kol'yakova, Rabinovich, et al., 1971
Kol'yakova, G.M.; Rabinovich, I.B.; Vyazankin, N.S.,
Dokl. Akad. Nauk SSSR, 1971, 200, 1, 111. [all data]
Pedley and Rylance, 1977
Pedley, J.B.; Rylance, J.,
Computer Analysed Thermochemical Data: Organic and Organometallic Compounds, University of Sussex, Brigton, 1977. [all data]
Goncharov, Karapet'yants, et al., 1970
Goncharov, A.K.; Karapet'yants, M.Kh.; Kol'yakova, G.M.,
Zh. Fiz. Khim., 1970, 44, 832. [all data]