Ge(OPh)4
- Formula: C24H20GeO4
- Molecular weight: 445.05

Condensed phase thermochemistry data

Data compiled by: José A. Martinho Simões
Quantity | Value | Units | Method | Reference | Comment |
---|---|---|---|---|---|
ΔfH°liquid | -459.8 ± 5.6 | kJ/mol | Review | Martinho Simões | The enthalpy of formation has been derived on the basis of GeO2(am). |
Quantity | Value | Units | Method | Reference | Comment |
ΔcH°liquid | -12381.7 ± 4.2 | kJ/mol | CC-SB | Shaulov, Fedorov, et al., 1970 | Please also see Pedley and Rylance, 1977. Authors have accepted the formation of GeO2(cr, hexagonal) |

Phase change data

Data compiled by: José A. Martinho Simões
Quantity | Value | Units | Method | Reference | Comment |
---|---|---|---|---|---|
ΔvapH° | 37.4 ± 0.4 | kJ/mol | CC-SB | Shaulov, Fedorov, et al., 1970 |

Gas phase thermochemistry data

Data compiled by: José A. Martinho Simões

Quantity Value Units Method Reference Comment
Δfgas-101.0 ± 1.3kcal/molReviewMartinho SimõesThe enthalpy of formation has been derived on the basis of GeO2(am).

References

Martinho Simões
Martinho Simões, J.A.,
Private communication (see http://webbook.nist.gov/chemistry/om/). [all data]
Shaulov, Fedorov, et al., 1970
Shaulov, Yu.Kh.; Fedorov, A.K.; Zueva, G.Ya.; Borisyuk, G.V.; Genchel, V.G.,
Russ. J. Phys. Chem., 1970, 44, 1181. [all data]
Pedley and Rylance, 1977
Pedley, J.B.; Rylance, J.,
Computer Analysed Thermochemical Data: Organic and Organometallic Compounds, University of Sussex, Brigton, 1977. [all data]