Ge(Et)3(OO-t-Bu)
- Formula: C10H24GeO2
- Molecular weight: 248.94

Condensed phase thermochemistry data

Data compiled by: José A. Martinho Simões
Quantity | Value | Units | Method | Reference | Comment |
---|---|---|---|---|---|
ΔfH°liquid | -488.0 ± 5.9 | kJ/mol | Review | Martinho Simões | |
Quantity | Value | Units | Method | Reference | Comment |
ΔcH°liquid | -7416.1 ± 5.4 | kJ/mol | CC-SB | Rabinovich, Kiparisov, et al., 1971 | Please also see Pedley and Rylance, 1977. |

Phase change data

Data compiled by: José A. Martinho Simões
Quantity | Value | Units | Method | Reference | Comment |
---|---|---|---|---|---|
ΔvapH° | 43.5 ± 4.2 | kJ/mol | CC-SB | Rabinovich, Kiparisov, et al., 1971 |

Gas phase thermochemistry data

Data compiled by: José A. Martinho Simões
Quantity | Value | Units | Method | Reference | Comment |
---|---|---|---|---|---|
ΔfH°gas | -106.2 ± 1.7 | kcal/mol | Review | Martinho Simões |

References

Martinho Simões
Martinho Simões, J.A.,
Private communication (see http://webbook.nist.gov/chemistry/om/). [all data]
Rabinovich, Kiparisov, et al., 1971
Rabinovich, I.B.; Kiparisov, E.G.; Aleksandrov, Y.A.,
Dokl. Akad. Nauk SSSR, 1971, 200, 5, 1116. [all data]
Pedley and Rylance, 1977
Pedley, J.B.; Rylance, J.,
Computer Analysed Thermochemical Data: Organic and Organometallic Compounds, University of Sussex, Brigton, 1977. [all data]