Ge(Bz)4
- Formula: C28H28Ge
- Molecular weight: 437.16

Gas phase thermochemistry data

Data compiled by: José A. Martinho Simões
Quantity | Value | Units | Method | Reference | Comment |
---|---|---|---|---|---|
ΔfH°gas | 388. ± 14. | kJ/mol | Review | Martinho Simões |

Condensed phase thermochemistry data

Data compiled by: José A. Martinho Simões
Quantity | Value | Units | Method | Reference | Comment |
---|---|---|---|---|---|
ΔfH°solid | 220. ± 11. | kJ/mol | Review | Martinho Simões | |
Quantity | Value | Units | Method | Reference | Comment |
ΔcH°solid | -15794. ± 11. | kJ/mol | CC-RB | Carson, Carson, et al., 1970 | Please also see Pedley and Rylance, 1977. |

Phase change data

Data compiled by: José A. Martinho Simões
Quantity | Value | Units | Method | Reference | Comment |
---|---|---|---|---|---|
ΔsubH° | 168.6 ± 8.4 | kJ/mol | CC-RB | Carson, Carson, et al., 1970 |

References

Martinho Simões
Martinho Simões, J.A.,
Private communication (see http://webbook.nist.gov/chemistry/om/). [all data]
Carson, Carson, et al., 1970
Carson, A.S.; Carson, E.M.; Laye, P.G.; Spencer, J.A.; Steele, W.V.,
Enthalpy of combustion of organo-metallic compounds measured with a vacuum-jacketed, rotating, aneroid calorimeter. The enthalpies of formation of germanium tetrabenzyl and di-germanium hexaphenyl,
Trans. Faraday Soc., 1970, 66, 2459, https://doi.org/10.1039/tf9706602459
. [all data]
Pedley and Rylance, 1977
Pedley, J.B.; Rylance, J.,
Computer Analysed Thermochemical Data: Organic and Organometallic Compounds, University of Sussex, Brigton, 1977. [all data]