Ge(Ph)3(CCPh)

Condensed phase thermochemistry data

Data compiled by: José A. Martinho Simões

Quantity Value Units Method Reference Comment
Δfsolid471.4 ± 7.8kJ/molReviewMartinho Simões
Quantity Value Units Method Reference Comment
Δcsolid-14115.7 ± 7.0kJ/molCC-RBCarson, Jamea, et al., 1988

References

Martinho Simões
Martinho Simões, J.A., Private communication (see http://webbook.nist.gov/chemistry/om/). [all data]

Carson, Jamea, et al., 1988
Carson, A.S.; Jamea, E.H.; Laye, P.G.; Spencer, J.A., J. Chem. Thermodyn., 1988, 20, 1223. [all data]