Ge(Ph)3(CHCH2)

Phase change data

Data compiled by: José A. Martinho Simões

Quantity Value Units Method Reference Comment
Δsub98.7 ± 1.6kJ/molCC-RBCarson, Jamea, et al., 1988

References

Carson, Jamea, et al., 1988
Carson, A.S.; Jamea, E.H.; Laye, P.G.; Spencer, J.A., J. Chem. Thermodyn., 1988, 20, 1223. [all data]