In(Me)2

Reaction thermochemistry data

Data compiled by: José A. Martinho Simões

Individual Reactions

Trimethylindium (g) = C2H6In (g) + Methane (g)

By formula: C3H9In (g) = C2H6In (g) + CH4 (g)

Quantity Value Units Method Reference Comment
Δr205. - 218.kJ/molN/ASmith and Patrick, 1983
Δr205. ± 17.kJ/molN/AMcMillen and Golden, 1982

Gas phase thermochemistry data

Data compiled by: José A. Martinho Simões

Quantity Value Units Method Reference Comment
Δfgas267. ± 19.kJ/molReviewMartinho SimõesThe enthalpy of formation relies on 208.6 ± 9.9 kJ/mol for the enthalpy of formation of In(Me)3(g).
Δfgas267. - 280.kJ/molReviewMartinho SimõesThe enthalpy of formation limits rely on 208.6 ± 9.9 kJ/mol for the enthalpy of formation of In(Me)3(g).

References

Smith and Patrick, 1983
Smith, G.P.; Patrick, R., Int. J. Chem. Kinet., 1983, 15, 167. [all data]

McMillen and Golden, 1982
McMillen, D.F.; Golden, D.M., Hydrocarbon bond dissociation energies, Ann. Rev. Phys. Chem., 1982, 33, 493. [all data]