Ga(I)2(Me)
- Formula: CH3GaI2
- Molecular weight: 338.566

Reaction thermochemistry data

Data compiled by: José A. Martinho Simões
Individual Reactions
(l) + 2
(cr) = CH3GaI2 (cr) + 2
(l)
By formula: C3H9Ga (l) + 2I2 (cr) = CH3GaI2 (cr) + 2CH3I (l)
Quantity | Value | Units | Method | Reference | Comment |
---|---|---|---|---|---|
ΔrH° | -37.9 ± 1.0 | kcal/mol | RSC | Fowell and Mortimer, 1958 | Please also see Pedley and Rylance, 1977 and Cox and Pilcher, 1970. |

References

Fowell and Mortimer, 1958
Fowell, P.A.; Mortimer, C.T.,
J. Chem. Soc., 1958, 3734.. [all data]
Pedley and Rylance, 1977
Pedley, J.B.; Rylance, J.,
Computer Analysed Thermochemical Data: Organic and Organometallic Compounds, University of Sussex, Brigton, 1977. [all data]
Cox and Pilcher, 1970
Cox, J.D.; Pilcher, G.,
Thermochemistry of Organic and Organometallic Compounds
in Academic Press, New York, 1970. [all data]