Ga(Me)2
- Formula: C2H6Ga
- Molecular weight: 99.792

Gas phase thermochemistry data

Data compiled by: José A. Martinho Simões
Quantity | Value | Units | Method | Reference | Comment |
---|---|---|---|---|---|
ΔfH°gas | 19.3 ± 4.7 | kcal/mol | Review | Martinho Simões | The enthalpy of formation relies on -8.6 ± 2.4 kcal/mol for the enthalpy of formation of Ga(Me)3(g). |
ΔfH°gas | 18. to 21. | kcal/mol | Review | Martinho Simões | The enthalpy of formation limits rely on -8.6 ± 2.4 kcal/mol for the enthalpy of formation of Ga(Me)3(g). |

References

Martinho Simões
Martinho Simões, J.A.,
Private communication (see http://webbook.nist.gov/chemistry/om/). [all data]