Al2(Br)3(Et)3
- Formula: C6H15Al2Br3
- Molecular weight: 380.858

Condensed phase thermochemistry data

Data compiled by: José A. Martinho Simões
Quantity | Value | Units | Method | Reference | Comment |
---|---|---|---|---|---|
ΔfH°liquid | -179.9 ± 2.2 | kcal/mol | Review | Martinho Simões | The enthalpy of formation relies on -101.5 ± 2.1 kcal/mol for the enthalpy of formation of Al(Br)2(Et)(l) and on -77.87 ± 0.84 kcal/mol for the enthalpy of formation of Al(Br)(Et)2(l). |

References

Martinho Simões
Martinho Simões, J.A.,
Private communication (see http://webbook.nist.gov/chemistry/om/). [all data]