Al(I)2(Et)
- Formula: C2H5AlI2
- Molecular weight: 309.8516

Condensed phase thermochemistry data

Data compiled by: José A. Martinho Simões
Quantity | Value | Units | Method | Reference | Comment |
---|---|---|---|---|---|
ΔfH°liquid | -66.2 ± 2.1 | kcal/mol | Review | Martinho Simões | The enthalpy of formation relies on -44.8 ± 1.2 kcal/mol for the enthalpy of formation of Al(Et)3(l) and on -59.82 ± 0.84 kcal/mol for the enthalpy of formation of Al(I)(Et)2(l). |

References

Martinho Simões
Martinho Simões, J.A.,
Private communication (see http://webbook.nist.gov/chemistry/om/). [all data]