Al(Cl)(i-Bu)2
- Formula: C8H18AlCl
- Molecular weight: 176.663

Phase change data

Data compiled by: José A. Martinho Simões
Quantity | Value | Units | Method | Reference | Comment |
---|---|---|---|---|---|
ΔvapH° | 20.5 | kcal/mol | RSC | Knap, Leech, et al., 1957 |

Gas phase thermochemistry data

Data compiled by: José A. Martinho Simões

Quantity Value Units Method Reference Comment
Δfgas-414.7kJ/molReviewMartinho Simões
Δfgas-411.kJ/molReviewMartinho Simões

Condensed phase thermochemistry data

Data compiled by: José A. Martinho Simões

Quantity Value Units Method Reference Comment
Δfliquid-500.3 ± 9.0kJ/molReviewMartinho Simões
Δfliquid-496.6 ± 6.8kJ/molReviewMartinho Simões
Quantity Value Units Method Reference Comment
Δcliquid-6086.0 ± 6.7kJ/molCC-SBPawlenko, 1969The enthalpy of combustion was corrected according to the method used in Pawlenko, 1969.

References

Knap, Leech, et al., 1957
Knap, J.E.; Leech, R.E.; Reid, A.J.; Tamplin, W.S.,
Ind. Eng. Chem., 1957, 49, 874. [all data]