Al(i-Bu)3
- Formula: C12H27Al
- Molecular weight: 198.3243

Gas phase thermochemistry data

Data compiled by: José A. Martinho Simões
Quantity | Value | Units | Method | Reference | Comment |
---|---|---|---|---|---|
ΔfH°gas | -327.3 | kJ/mol | Review | Martinho Simões | The molar fraction of monomer in liquid tri-isobutylaluminum at 298 K is ca. 74% Smith, 1970. |
ΔfH°gas | -231.5 | kJ/mol | Review | Martinho Simões | The molar fraction of monomer in liquid tri-isobutylaluminum at 298 K is ca. 74% Smith, 1970. |

Condensed phase thermochemistry data

Data compiled by: José A. Martinho Simões
Quantity | Value | Units | Method | Reference | Comment |
---|---|---|---|---|---|
ΔfH°liquid | -388.4 ± 7.7 | kJ/mol | Review | Martinho Simões | The molar fraction of monomer in liquid tri-isobutylaluminum at 298 K is ca. 74% Smith, 1970. |
ΔfH°liquid | -293. ± 30. | kJ/mol | Review | Martinho Simões | The molar fraction of monomer in liquid tri-isobutylaluminum at 298 K is ca. 74% Smith, 1970. |
Quantity | Value | Units | Method | Reference | Comment |
ΔcH°liquid | -9030.3 ± 7.5 | kJ/mol | CC-SB | Pawlenko, 1967 | Please also see Pedley and Rylance, 1977 and Cox and Pilcher, 1970. |
ΔcH°liquid | -9126. ± 30. | kJ/mol | CC-SB | Shaulov, Tubyanskaya, et al., 1964 | Please also see Cox and Pilcher, 1970. |

Phase change data

Data compiled by: José A. Martinho Simões
Quantity | Value | Units | Method | Reference | Comment |
---|---|---|---|---|---|
ΔvapH° | 61.1 | kJ/mol | CC-SB | Knap, Leech, et al., 1957 |

References

Martinho Simões
Martinho Simões, J.A.,
Private communication (see http://webbook.nist.gov/chemistry/om/). [all data]
Smith, 1970
Smith, M.B.,
J. Organometal. Chem., 1970, 22, 273. [all data]
Pawlenko, 1967
Pawlenko, S.,
Chem. Ber., 1967, 100, 3591. [all data]
Pedley and Rylance, 1977
Pedley, J.B.; Rylance, J.,
Computer Analysed Thermochemical Data: Organic and Organometallic Compounds, University of Sussex, Brigton, 1977. [all data]
Cox and Pilcher, 1970
Cox, J.D.; Pilcher, G.,
Thermochemistry of Organic and Organometallic Compounds
in Academic Press, New York, 1970. [all data]
Shaulov, Tubyanskaya, et al., 1964
Shaulov, Y.K.; Tubyanskaya, V.S.; Evstegneeva, E.V.; Shmyreva, G.O.,
Russ. J. Phys. Chem., 1964, 38, 967. [all data]