Hg[Ge(i-Pr)3]2
- Formula: C18H42Ge2Hg
- Molecular weight: 604.40

Condensed phase thermochemistry data

Data compiled by: José A. Martinho Simões
Quantity | Value | Units | Method | Reference | Comment |
---|---|---|---|---|---|
ΔfH°liquid | -276.9 ± 6.3 | kJ/mol | Review | Martinho Simões | |
Quantity | Value | Units | Method | Reference | Comment |
ΔcH°liquid | -13886.7 ± 4.2 | kJ/mol | CC-SB | Kol'yakova, Rabinovich, et al., 1972 | Please also see Pedley and Rylance, 1977. |

Phase change data

Data compiled by: José A. Martinho Simões
Quantity | Value | Units | Method | Reference | Comment |
---|---|---|---|---|---|
ΔvapH° | 54.4 ± 4.2 | kJ/mol | CC-SB | Kol'yakova, Rabinovich, et al., 1972 |

Gas phase thermochemistry data

Data compiled by: José A. Martinho Simões
Quantity | Value | Units | Method | Reference | Comment |
---|---|---|---|---|---|
ΔfH°gas | -53.2 ± 1.8 | kcal/mol | Review | Martinho Simões |

References

Martinho Simões
Martinho Simões, J.A.,
Private communication (see http://webbook.nist.gov/chemistry/om/). [all data]
Kol'yakova, Rabinovich, et al., 1972
Kol'yakova, G.M.; Rabinovich, I.B.; Gladyshev, E.N.; Vyazankin, N.S.,
Dokl. Akad. Nauk SSSR, 1972, 204, 2, 356. [all data]
Pedley and Rylance, 1977
Pedley, J.B.; Rylance, J.,
Computer Analysed Thermochemical Data: Organic and Organometallic Compounds, University of Sussex, Brigton, 1977. [all data]