Hg[Ge(Et)3]2
- Formula: C12H30Ge2Hg
- Molecular weight: 520.24

Gas phase thermochemistry data

Data compiled by: José A. Martinho Simões
Quantity | Value | Units | Method | Reference | Comment |
---|---|---|---|---|---|
ΔfH°gas | -41.8 ± 7.3 | kJ/mol | Review | Martinho Simões |

Condensed phase thermochemistry data

Data compiled by: José A. Martinho Simões
Quantity | Value | Units | Method | Reference | Comment |
---|---|---|---|---|---|
ΔfH°liquid | -104.6 ± 6.0 | kJ/mol | Review | Martinho Simões | |
Quantity | Value | Units | Method | Reference | Comment |
ΔcH°liquid | -9983.0 ± 4.2 | kJ/mol | CC-SB | Kol'yakova, Rabinovich, et al., 1972 | Please also see Pedley and Rylance, 1977. |

Phase change data

Data compiled by: José A. Martinho Simões
Quantity | Value | Units | Method | Reference | Comment |
---|---|---|---|---|---|
ΔvapH° | 62.8 ± 4.2 | kJ/mol | CC-SB | Kol'yakova, Rabinovich, et al., 1972 |

References

Martinho Simões
Martinho Simões, J.A.,
Private communication (see http://webbook.nist.gov/chemistry/om/). [all data]
Kol'yakova, Rabinovich, et al., 1972
Kol'yakova, G.M.; Rabinovich, I.B.; Gladyshev, E.N.; Vyazankin, N.S.,
Dokl. Akad. Nauk SSSR, 1972, 204, 2, 356. [all data]
Pedley and Rylance, 1977
Pedley, J.B.; Rylance, J.,
Computer Analysed Thermochemical Data: Organic and Organometallic Compounds, University of Sussex, Brigton, 1977. [all data]