Hg(Et)

Gas phase thermochemistry data

Data compiled by: José A. Martinho Simões

Quantity Value Units Method Reference Comment
Δfgas161. ± 17.kJ/molReviewMartinho SimõesThe enthalpy of formation relies on 75.0 ± 2.3 kJ/mol for the enthalpy of formation of Hg(Et)2(g).
Δfgas157.kJ/molReviewMartinho SimõesThe enthalpy of formation relies on 75.0 ± 2.3 kJ/mol for the enthalpy of formation of Hg(Et)2(g).

References

Martinho Simões
Martinho Simões, J.A., Private communication (see http://webbook.nist.gov/chemistry/om/). [all data]