Hg(Me)
- Formula: CH3Hg
- Molecular weight: 215.62

Gas phase thermochemistry data

Data compiled by: José A. Martinho Simões
Quantity | Value | Units | Method | Reference | Comment |
---|---|---|---|---|---|
ΔfH°gas | 47.9 ± 4.1 | kcal/mol | Review | Martinho Simões | The enthalpy of formation relies on 22.1 ± 0.74 kcal/mol for the enthalpy of formation of Hg(Me)2(g). |
ΔfH°gas | 45.9 to 48.8 | kcal/mol | Review | Martinho Simões | The enthalpy of formation limits rely on 22.1 ± 0.74 kcal/mol for the enthalpy of formation of Hg(Me)2(g). |
ΔfH°gas | 44.1 ± 1.7 | kcal/mol | Review | Martinho Simões | The enthalpy of formation relies on 22.1 ± 0.74 kcal/mol for the enthalpy of formation of Hg(Me)2(g). |

Reaction thermochemistry data

Data compiled by: José A. Martinho Simões

Individual Reactions

Mercury, dimethyl- (g) = CH3Hg (g) + Methane (g)

By formula: C2H6Hg (g) = CH3Hg (g) + CH4 (g)

Quantity Value Units Method Reference Comment
Δr239.3 ± 6.3kJ/molKinGJackson, 1989
Δr247. - 259.kJ/molN/ASmith and Patrick, 1983
Δr255. ± 17.kJ/molN/AMcMillen and Golden, 1982

References

Martinho Simões
Martinho Simões, J.A.,
Private communication (see http://webbook.nist.gov/chemistry/om/). [all data]