Cd[N(SiMe3)2]2
- Formula: C12H36CdN2Si4
- Molecular weight: 433.181

Phase change data

Data compiled by: José A. Martinho Simões
Quantity | Value | Units | Method | Reference | Comment |
---|---|---|---|---|---|
ΔvapH° | 70. ± 10. | kJ/mol | RSC | Gümrükçüoglü, Jeffery, et al., 1988 |

Condensed phase thermochemistry data

Data compiled by: José A. Martinho Simões
Quantity | Value | Units | Method | Reference | Comment |
---|---|---|---|---|---|
ΔfH°liquid | -853. ± 21. | kJ/mol | Review | Martinho Simões |

Gas phase thermochemistry data

Data compiled by: José A. Martinho Simões
Quantity | Value | Units | Method | Reference | Comment |
---|---|---|---|---|---|
ΔfH°gas | -187.0 ± 5.5 | kcal/mol | RSC | Gümrükçüoglü, Jeffery, et al., 1988 | Value corrected based on a set of ancillary data by J.A. Martinho Simões |

References

Gümrükçüoglü, Jeffery, et al., 1988
Gümrükçüoglü, I.E.; Jeffery, J.; Lappert, M.F.; Pedley, J.B.; Rai A.K.,
J. Organometal. Chem., 1988, 341, 53. [all data]