Cd(Bu)2
- Formula: C8H18Cd
- Molecular weight: 226.640

Phase change data

Data compiled by: José A. Martinho Simões
Quantity | Value | Units | Method | Reference | Comment |
---|---|---|---|---|---|
ΔvapH° | 16.2 ± 0.29 | kcal/mol | N/A | Sokolovskii and Baev, 1985 |

References

Sokolovskii and Baev, 1985
Sokolovskii, A.E.; Baev, A.K.,
Vestsi Akad. Navuk BSSR, Ser. Khim. Navuk, 1985, 112.. [all data]