Zn(CH2SiMe3)2
- Formula: C8H22Si2Zn
- Molecular weight: 239.81

Gas phase thermochemistry data

Data compiled by: José A. Martinho Simões
Quantity | Value | Units | Method | Reference | Comment |
---|---|---|---|---|---|
ΔfH°gas | -331. ± 17. | kJ/mol | Review | Martinho Simões | The uncertainty assigned to the enthalpy of formation has been estimated in Gümrükçüoglü, Jeffery, et al., 1988. |

Condensed phase thermochemistry data

Data compiled by: José A. Martinho Simões
Quantity | Value | Units | Method | Reference | Comment |
---|---|---|---|---|---|
ΔfH°liquid | -385. ± 14. | kJ/mol | Review | Martinho Simões | The uncertainty assigned to the enthalpy of formation has been estimated in Gümrükçüoglü, Jeffery, et al., 1988. |

Phase change data

Data compiled by: José A. Martinho Simões
Quantity | Value | Units | Method | Reference | Comment |
---|---|---|---|---|---|
ΔvapH° | 54. ± 10. | kJ/mol | RSC | Gümrükçüoglü, Jeffery, et al., 1988 |

References

Martinho Simões
Martinho Simões, J.A.,
Private communication (see http://webbook.nist.gov/chemistry/om/). [all data]
Gümrükçüoglü, Jeffery, et al., 1988
Gümrükçüoglü, I.E.; Jeffery, J.; Lappert, M.F.; Pedley, J.B.; Rai A.K.,
J. Organometal. Chem., 1988, 341, 53. [all data]