Zn(Bu)2
- Formula: C8H18Zn
- Molecular weight: 179.61

Condensed phase thermochemistry data

Data compiled by: José A. Martinho Simões
Quantity | Value | Units | Method | Reference | Comment |
---|---|---|---|---|---|
ΔfH°liquid | -25.3 ± 5.6 | kcal/mol | Review | Martinho Simões | |
Quantity | Value | Units | Method | Reference | Comment |
ΔcH°liquid | -1425.7 ± 5.6 | kcal/mol | CC-SB | Long and Norrish, 1949 | Please also see Pedley and Rylance, 1977 and Cox and Pilcher, 1970. |

Phase change data

Data compiled by: José A. Martinho Simões
Quantity | Value | Units | Method | Reference | Comment |
---|---|---|---|---|---|
ΔvapH° | 12.1 ± 0.07 | kcal/mol | CC-SB | Sokolovskii and Baev, 1984 | Another value for the enthalpy of vaporization has been reported: 13.0 ± 0.79 kcal/mol Hatch, Sutherland, et al., 1949. |

Gas phase thermochemistry data

Data compiled by: José A. Martinho Simões
Quantity | Value | Units | Method | Reference | Comment |
---|---|---|---|---|---|
ΔfH°gas | -13.2 ± 5.6 | kcal/mol | Review | Martinho Simões |

References

Martinho Simões
Martinho Simões, J.A.,
Private communication (see http://webbook.nist.gov/chemistry/om/). [all data]
Long and Norrish, 1949
Long, L.H.; Norrish, R.G.W.,
Phil. Trans. Roy. Soc. (London), 1949, A241, 587. [all data]
Pedley and Rylance, 1977
Pedley, J.B.; Rylance, J.,
Computer Analysed Thermochemical Data: Organic and Organometallic Compounds, University of Sussex, Brigton, 1977. [all data]
Cox and Pilcher, 1970
Cox, J.D.; Pilcher, G.,
Thermochemistry of Organic and Organometallic Compounds
in Academic Press, New York, 1970. [all data]
Sokolovskii and Baev, 1984
Sokolovskii, A.E.; Baev, A.K.,
Russ. J. Phys. Chem., 1984, 58, 1635. [all data]
Hatch, Sutherland, et al., 1949
Hatch, L.F.; Sutherland, G.; Ross, W.J.,
J. Org. Chem., 1949, 14, 1130. [all data]