Ag2C2
- Formula: C2Ag2
- Molecular weight: 239.7578

Reaction thermochemistry data

Data compiled by: José A. Martinho Simões
Individual Reactions
C2Ag2 (cr) + 2( • 12.3
) (solution) =
(aq) + 2
(cr)
By formula: C2Ag2 (cr) + 2(HCl • 12.3H2O) (solution) = C2H2 (aq) + 2AgCl (cr)
Quantity | Value | Units | Method | Reference | Comment |
---|---|---|---|---|---|
ΔrH° | -18.6 ± 0.1 | kcal/mol | RSC | Finch, Gardner, et al., 1991 |

Condensed phase thermochemistry data

Data compiled by: José A. Martinho Simões

Quantity Value Units Method Reference Comment
Δfsolid84.73 ± 0.65kcal/molReviewMartinho Simões
Δfsolid85.97 ± 0.38kcal/molReviewMartinho Simões
Δfsolid85.61 ± 0.76kcal/molReviewMartinho Simões
Δfsolid85.5 ± 1.2kcal/molN/AFinch, Gardner, et al., 1991Value corrected based on a set of ancillary data by J.A. Martinho Simões

References

Finch, Gardner, et al., 1991
Finch, A.; Gardner, P.J.; Head, A.J.; Majdi, H.S.,
Thermochim. Acta, 1991, 180, 325. [all data]