Pt(1,2-cbda)(NH2Me)2
- Formula: C8H16N2O4Pt
- Molecular weight: 399.308

Condensed phase thermochemistry data

Data compiled by: José A. Martinho Simões
Quantity | Value | Units | Method | Reference | Comment |
---|---|---|---|---|---|
ΔfH°solid | -861.6 ± 8.6 | kJ/mol | Review | Martinho Simões | The enthalpy of formation relies on -424.2 ± 8.3 kJ/mol for the enthalpy of formation of cis-Pt(Cl)2(NH2Me)2(cr). |

Phase change data

Data compiled by: José A. Martinho Simões
Quantity | Value | Units | Method | Reference | Comment |
---|---|---|---|---|---|
ΔsubH° | 318. ± 20. | kJ/mol | RSC | Mortimer, 1984 |

Gas phase thermochemistry data

Data compiled by: José A. Martinho Simões
Quantity | Value | Units | Method | Reference | Comment |
---|---|---|---|---|---|
ΔfH°gas | -129.9 ± 5.2 | kcal/mol | Review | Martinho Simões | The enthalpy of formation relies on -101.4 ± 2.0 kcal/mol for the enthalpy of formation of cis-Pt(Cl)2(NH2Me)2(cr). |

References

Martinho Simões
Martinho Simões, J.A.,
Private communication (see http://webbook.nist.gov/chemistry/om/). [all data]
Mortimer, 1984
Mortimer, C.T.,
Rev. Inorg. Chem., 1984, 6, 233. [all data]