Pt(1,1-cbda)(NH2-i-Pr)2
- Formula: C12H24N2O4Pt
- Molecular weight: 455.414

Gas phase thermochemistry data

Data compiled by: José A. Martinho Simões
Quantity | Value | Units | Method | Reference | Comment |
---|---|---|---|---|---|
ΔfH°gas | -755. ± 21. | kJ/mol | Review | Martinho Simões | The enthalpy of formation relies on -599.0 ± 5.3 kJ/mol for the enthalpy of formation of cis-Pt(Cl)2(NH2-i-Pr)2(cr). |

Condensed phase thermochemistry data

Data compiled by: José A. Martinho Simões
Quantity | Value | Units | Method | Reference | Comment |
---|---|---|---|---|---|
ΔfH°solid | -1104.5 ± 5.4 | kJ/mol | Review | Martinho Simões | The enthalpy of formation relies on -599.0 ± 5.3 kJ/mol for the enthalpy of formation of cis-Pt(Cl)2(NH2-i-Pr)2(cr). |

Phase change data

Data compiled by: José A. Martinho Simões
Quantity | Value | Units | Method | Reference | Comment |
---|---|---|---|---|---|
ΔsubH° | 350. ± 20. | kJ/mol | RSC | Mortimer, 1984 |

References

Martinho Simões
Martinho Simões, J.A.,
Private communication (see http://webbook.nist.gov/chemistry/om/). [all data]