Pt(1,1-cbda)(NH2Et)2
- Formula: C10H20N2O4Pt
- Molecular weight: 427.361

Phase change data

Data compiled by: José A. Martinho Simões
Quantity | Value | Units | Method | Reference | Comment |
---|---|---|---|---|---|
ΔsubH° | 334. ± 20. | kJ/mol | RSC | Mortimer, 1984 |

Gas phase thermochemistry data

Data compiled by: José A. Martinho Simões

Quantity Value Units Method Reference Comment
Δfgas-657. ± 22.kJ/molReviewMartinho SimõesThe enthalpy of formation relies on -490. ± 10. kJ/mol for the estimated enthalpy of formation of cis-Pt(Cl)2(NH2Et)2(cr) Al-Takhin, Pilcher, et al., 1983.

Condensed phase thermochemistry data

Data compiled by: José A. Martinho Simões

Quantity Value Units Method Reference Comment
Δfsolid-991. ± 10.kJ/molReviewMartinho SimõesThe enthalpy of formation relies on -490. ± 10. kJ/mol for the estimated enthalpy of formation of cis-Pt(Cl)2(NH2Et)2(cr) Al-Takhin, Pilcher, et al., 1983.

References

Mortimer, 1984
Mortimer, C.T.,
Rev. Inorg. Chem., 1984, 6, 233. [all data]